Reaction Details
TargetMonoglyceride lipase
LigandBDBM50432847
Substrate/Competitorn/a
Meas. Tech.ChEMBL_956342 (CHEMBL2379576)
IC50 6.0±n/a nM
Citation Holtfrerich, AHanekamp, WLehr, M (4-Phenoxyphenyl)tetrazolecarboxamides and related compounds as dual inhibitors of fatty acid amide hydrolase (FAAH) and monoacylglycerol lipase (MAGL). Eur J Med Chem63:64-75 (2013) 
 
Monoglyceride lipase
Name:Monoglyceride lipase
Type:Hydrolase
Mol. Mass.:33264.56
Organism:Homo sapiens (Human)
Description:Human recombinant MGL (Cayman Chemical, cat# 10008354).
Residue:303
BDBM50432847
NameBDBM50432847
Synonyms:CHEMBL2376220
TypeSmall organic molecule
Emp. Form.C16H14ClN5O2
Mol. Mass.343.768
SMILESCN(C)C(=O)n1nnc(n1)-c1ccc(Oc2cccc(Cl)c2)cc1