Reaction Details
TargetSerine/threonine-protein kinase pim-3
LigandBDBM50432942
Substrate/Competitorn/a
Meas. Tech.ChEMBL_957667 (CHEMBL2378595)
IC50 33±n/a nM
Citation Gavara, LSuchaud, VNauton, LThéry, VAnizon, FMoreau, P Identification of pyrrolo[2,3-g]indazoles as new Pim kinase inhibitors. Bioorg Med Chem Lett23:2298-301 (2013) 
 
Serine/threonine-protein kinase pim-3
Name:Serine/threonine-protein kinase pim-3
Type:Protein
Mol. Mass.:35888.19
Organism:Homo sapiens (Human)
Description:Q86V86
Residue:326
BDBM50432942
NameBDBM50432942
Synonyms:CHEMBL2377721
TypeSmall organic molecule
Emp. Form.C9H8N4
Mol. Mass.172.1866
SMILESNc1cc2cn[nH]c2c2cc[nH]c12