Reaction Details
TargetSerine/threonine-protein kinase pim-3
LigandBDBM50432946
Substrate/Competitorn/a
Meas. Tech.ChEMBL_957667 (CHEMBL2378595)
IC50 119±n/a nM
Citation Gavara, LSuchaud, VNauton, LThéry, VAnizon, FMoreau, P Identification of pyrrolo[2,3-g]indazoles as new Pim kinase inhibitors. Bioorg Med Chem Lett23:2298-301 (2013) 
 
Serine/threonine-protein kinase pim-3
Name:Serine/threonine-protein kinase pim-3
Type:Protein
Mol. Mass.:35888.19
Organism:Homo sapiens (Human)
Description:Q86V86
Residue:326
BDBM50432946
NameBDBM50432946
Synonyms:CHEMBL2377711
TypeSmall organic molecule
Emp. Form.C17H14N4O2
Mol. Mass.306.3187
SMILESCCc1[nH]c2c(cc3cn[nH]c3c2c1-c1ccccc1)[N+]([O-])=O