Reaction Details
TargetExtracellular calcium-sensing receptor
LigandBDBM50432953
Substrate/Competitorn/a
Meas. Tech.ChEMBL_957699 (CHEMBL2378664)
EC50 200±n/a nM
Citation Deprez, PTemal, TJary, HAuberval, MLively, SGuédin, DVevert, JP New potent calcimimetics: II. Discovery of benzothiazole trisubstituted ureas. Bioorg Med Chem Lett23:2455-9 (2013) 
 
Extracellular calcium-sensing receptor
Name:Extracellular calcium-sensing receptor
Type:Protein
Mol. Mass.:120663.13
Organism:Homo sapiens (Human)
Description:P41180
Residue:1078
BDBM50432953
NameBDBM50432953
Synonyms:CHEMBL2377732
TypeSmall organic molecule
Emp. Form.C26H32N4O3
Mol. Mass.448.5573
SMILESCc1cc(NC(=O)N(CCC(c2ccccc2)c2ccccc2)CCN2CCOCC2)no1