Reaction Details
TargetExtracellular calcium-sensing receptor
LigandBDBM50432960
Substrate/Competitorn/a
Meas. Tech.ChEMBL_957699 (CHEMBL2378664)
EC50 80±n/a nM
Citation Deprez, PTemal, TJary, HAuberval, MLively, SGuédin, DVevert, JP New potent calcimimetics: II. Discovery of benzothiazole trisubstituted ureas. Bioorg Med Chem Lett23:2455-9 (2013) 
 
Extracellular calcium-sensing receptor
Name:Extracellular calcium-sensing receptor
Type:Protein
Mol. Mass.:120663.13
Organism:Homo sapiens (Human)
Description:P41180
Residue:1078
BDBM50432960
NameBDBM50432960
Synonyms:KRN-568 Norcalcin TECALCET HYDROCHLORIDE | Tecalcet HCl
TypeSmall organic molecule
Emp. Form.C18H22ClNO
Mol. Mass.303.826
SMILESCOc1cccc(c1)[C@@H](C)NCCCc1ccccc1Cl