Reaction Details
TargetCarbonic anhydrase
LigandBDBM50387114
Substrate/Competitorn/a
Meas. Tech.ChEMBL_955915 (CHEMBL2379884)
Ki 141±n/a nM
Citation Vullo, DLeewattanapasuk, WMühlschlegel, FAMastrolorenzo, ACapasso, CSupuran, CT Carbonic anhydrase inhibitors: inhibition of the฿-class enzyme from the pathogenic yeast Candida glabrata with sulfonamides, sulfamates and sulfamides. Bioorg Med Chem Lett23:2647-52 (2013) 
 
Carbonic anhydrase
Name:Carbonic anhydrase
Type:Enzyme
Mol. Mass.:31587.59
Organism:Candida albicans (Yeast)
Description:n/a
Residue:281
BDBM50387114
NameBDBM50387114
Synonyms:CHEMBL2047796
TypeSmall organic molecule
Emp. Form.C13H13N3O4S
Mol. Mass.307.325
SMILESNS(=O)(=O)Oc1ccc(NC(=O)Nc2ccccc2)cc1