Reaction Details
TargetCarbonic anhydrase
LigandBDBM50428621
Substrate/Competitorn/a
Meas. Tech.ChEMBL_955915 (CHEMBL2379884)
Ki 72±n/a nM
Citation Vullo, DLeewattanapasuk, WMühlschlegel, FAMastrolorenzo, ACapasso, CSupuran, CT Carbonic anhydrase inhibitors: inhibition of the฿-class enzyme from the pathogenic yeast Candida glabrata with sulfonamides, sulfamates and sulfamides. Bioorg Med Chem Lett23:2647-52 (2013) 
 
Carbonic anhydrase
Name:Carbonic anhydrase
Type:Enzyme
Mol. Mass.:31587.59
Organism:Candida albicans (Yeast)
Description:n/a
Residue:281
BDBM50428621
NameBDBM50428621
Synonyms:CHEMBL2331768
TypeSmall organic molecule
Emp. Form.C19H18N4O3S
Mol. Mass.382.436
SMILESNS(=O)(=O)Nc1ccc(NC(=O)Nc2ccccc2-c2ccccc2)cc1