Reaction Details
TargetLong-chain fatty acid transport protein 1
LigandBDBM50433136
Substrate/Competitorn/a
Meas. Tech.ChEMBL_956919 (CHEMBL2378195)
IC50 390±n/a nM
Citation Matsufuji, TIkeda, MNaito, AHirouchi, MKanda, SIzumi, MHarada, JShinozuka, T Arylpiperazines as fatty acid transport protein 1 (FATP1) inhibitors with improved potency and pharmacokinetic properties. Bioorg Med Chem Lett23:2560-5 (2013) 
 
Long-chain fatty acid transport protein 1
Name:Long-chain fatty acid transport protein 1
Type:PROTEIN
Mol. Mass.:71289.41
Organism:Mus musculus
Description:ChEMBL_956919
Residue:646
BDBM50433136
NameBDBM50433136
Synonyms:CHEMBL2377619
TypeSmall organic molecule
Emp. Form.C19H20FN5O
Mol. Mass.353.3934
SMILESCc1nc2ccccn2c1C(=O)CN1CCN(CC1)c1ccc(F)cn1