Reaction Details
TargetLong-chain fatty acid transport protein 1
LigandBDBM50433130
Substrate/Competitorn/a
Meas. Tech.ChEMBL_956920 (CHEMBL2378196)
IC50 470±n/a nM
Citation Matsufuji, TIkeda, MNaito, AHirouchi, MKanda, SIzumi, MHarada, JShinozuka, T Arylpiperazines as fatty acid transport protein 1 (FATP1) inhibitors with improved potency and pharmacokinetic properties. Bioorg Med Chem Lett23:2560-5 (2013) 
 
Long-chain fatty acid transport protein 1
Name:Long-chain fatty acid transport protein 1
Type:PROTEIN
Mol. Mass.:71123.97
Organism:Homo sapiens (Human)
Description:ChEMBL_956920
Residue:646
BDBM50433130
NameBDBM50433130
Synonyms:CHEMBL2377612
TypeSmall organic molecule
Emp. Form.C19H18FN3O2
Mol. Mass.339.3635
SMILESFc1ccc(nc1)N1CCN(CC(=O)c2coc3ccccc23)CC1