Reaction Details
TargetLong-chain fatty acid transport protein 1
LigandBDBM50433132
Substrate/Competitorn/a
Meas. Tech.ChEMBL_956920 (CHEMBL2378196)
IC50 330±n/a nM
Citation Matsufuji, TIkeda, MNaito, AHirouchi, MKanda, SIzumi, MHarada, JShinozuka, T Arylpiperazines as fatty acid transport protein 1 (FATP1) inhibitors with improved potency and pharmacokinetic properties. Bioorg Med Chem Lett23:2560-5 (2013) 
 
Long-chain fatty acid transport protein 1
Name:Long-chain fatty acid transport protein 1
Type:PROTEIN
Mol. Mass.:71123.97
Organism:Homo sapiens (Human)
Description:ChEMBL_956920
Residue:646
BDBM50433132
NameBDBM50433132
Synonyms:CHEMBL2377614
TypeSmall organic molecule
Emp. Form.C18H18FN5O
Mol. Mass.339.3668
SMILESFc1ccc(nc1)N1CCN(CC(=O)c2cnn3ccccc23)CC1