Reaction Details
TargetSerine/threonine-protein kinase Chk1
LigandBDBM50433505
Substrate/Competitorn/a
Meas. Tech.ChEMBL_959664 (CHEMBL2382857)
IC50 10000±n/a nM
Citation Huang, XCheng, CCFischmann, TODuca, JSRichards, MTadikonda, PKReddy, PAZhao, LSiddiqui, MAParry, DDavis, NSeghezzi, WWiswell, DShipps, GW Structure-based design and optimization of 2-aminothiazole-4-carboxamide as a new class of CHK1 inhibitors. Bioorg Med Chem Lett23:2590-4 (2013) 
 
Serine/threonine-protein kinase Chk1
Name:Serine/threonine-protein kinase Chk1
Type:Enzyme Catalytic Domain
Mol. Mass.:54443.02
Organism:Homo sapiens (Human)
Description:gi_166295192
Residue:476
BDBM50433505
NameBDBM50433505
Synonyms:CHEMBL2381244
TypeSmall organic molecule
Emp. Form.C17H18N6OS
Mol. Mass.354.429
SMILESO=C(Nc1ccccc1N1CCNCC1)c1csc(n1)-n1ccnc1