Reaction Details
TargetNeuronal acetylcholine receptor subunit alpha-4/beta-2
LigandBDBM50433573
Substrate/Competitorn/a
Meas. Tech.ChEMBL_959891 (CHEMBL2383617)
Ki 8.1±n/a nM
Citation Faundez-Parraguez, MFarias-Rabelo, NGonzalez-Gutierrez, JPEtcheverry-Berrios, AAlzate-Morales, JAdasme-Carreño, FVaras, RBermudez, IIturriaga-Vasquez, P Neonicotinic analogues: selective antagonists fora4ß2 nicotinic acetylcholine receptors. Bioorg Med Chem21:2687-94 (2013) 
 
Neuronal acetylcholine receptor subunit alpha-4/beta-2
Name:Neuronal acetylcholine receptor subunit alpha-4/beta-2
Type:Protein
Mol. Mass.:n/a
Description:n/a
Components:This complex has 2 components.
Component 1
Name:Neuronal acetylcholine receptor subunit alpha-4
Synonyms:ACHA4_HUMAN CHRNA4 protein Neuronal acetylcholine receptor protein alpha-4 subunit Nicotinic acetylcholine receptor alpha4/beta2/alpha5
Type:n/a
Mol. Mass.:69963.49
Organism:Homo sapiens (Human)
Description:NACHRA4
Residue:627
Component 2
Name:Neuronal acetylcholine receptor subunit beta-2
Synonyms:ACHB2_HUMAN Neuronal acetylcholine receptor protein beta-2 subunit | Nicotinic acetylcholine receptor alpha3/beta2/alpha5
Type:Protein
Mol. Mass.:57020.50
Organism:Homo sapiens (Human)
Description:P17787
Residue:502
BDBM50433573
NameBDBM50433573
Synonyms:CHEMBL2381570
TypeSmall organic molecule
Emp. Form.C13H18N2O2
Mol. Mass.234.2942
SMILESCN1CCC[C@H]1COC(=O)c1cccc(N)c1