Reaction Details
TargetInsulin-like growth factor 1 receptor
LigandBDBM50433761
Substrate/Competitorn/a
Meas. Tech.ChEMBL_959958 (CHEMBL2383900)
IC50 12000±n/a nM
Citation Meng, ZCiavarri, JPMcRiner, AZhao, YZhao, LReddy, PAZhang, XFischmann, TOWhitehurst, CArshad Siddiqui, M Potency switch between CHK1 and MK2: discovery of imidazo[1,2-a]pyrazine- and imidazo[1,2-c]pyrimidine-based kinase inhibitors. Bioorg Med Chem Lett23:2863-7 (2013) 
 
Insulin-like growth factor 1 receptor
Name:Insulin-like growth factor 1 receptor
Type:Protein
Mol. Mass.:154776.79
Organism:Homo sapiens (Human)
Description:P08069
Residue:1367
BDBM50433761
NameBDBM50433761
Synonyms:CHEMBL2381601
TypeSmall organic molecule
Emp. Form.C19H21ClN6O
Mol. Mass.384.863
SMILESN[C@H]1CC[C@@H](CC1)Nc1ncc(C(N)=O)n2cc(nc12)-c1ccc(Cl)cc1