Reaction Details
TargetSerine/threonine-protein kinase Chk1
LigandBDBM50433771
Substrate/Competitorn/a
Meas. Tech.ChEMBL_959964 (CHEMBL2383906)
IC50 50000±n/a nM
Citation Meng, ZCiavarri, JPMcRiner, AZhao, YZhao, LReddy, PAZhang, XFischmann, TOWhitehurst, CArshad Siddiqui, M Potency switch between CHK1 and MK2: discovery of imidazo[1,2-a]pyrazine- and imidazo[1,2-c]pyrimidine-based kinase inhibitors. Bioorg Med Chem Lett23:2863-7 (2013) 
 
Serine/threonine-protein kinase Chk1
Name:Serine/threonine-protein kinase Chk1
Type:Enzyme Catalytic Domain
Mol. Mass.:54443.02
Organism:Homo sapiens (Human)
Description:gi_166295192
Residue:476
BDBM50433771
NameBDBM50433771
Synonyms:CHEMBL2381610
TypeSmall organic molecule
Emp. Form.C19H21ClN6O
Mol. Mass.384.863
SMILESNC(=O)c1cnc(NCC2CCCNC2)n2cc(nc12)-c1ccc(Cl)cc1