Reaction Details
TargetSerine/threonine-protein kinase Chk1
LigandBDBM50433766
Substrate/Competitorn/a
Meas. Tech.ChEMBL_959964 (CHEMBL2383906)
IC50 23±n/a nM
Citation Meng, ZCiavarri, JPMcRiner, AZhao, YZhao, LReddy, PAZhang, XFischmann, TOWhitehurst, CArshad Siddiqui, M Potency switch between CHK1 and MK2: discovery of imidazo[1,2-a]pyrazine- and imidazo[1,2-c]pyrimidine-based kinase inhibitors. Bioorg Med Chem Lett23:2863-7 (2013) 
 
Serine/threonine-protein kinase Chk1
Name:Serine/threonine-protein kinase Chk1
Type:Enzyme Catalytic Domain
Mol. Mass.:54443.02
Organism:Homo sapiens (Human)
Description:gi_166295192
Residue:476
BDBM50433766
NameBDBM50433766
Synonyms:CHEMBL2381604
TypeSmall organic molecule
Emp. Form.C22H22N6O
Mol. Mass.386.4497
SMILESNC(=O)c1cnc(N[C@H]2CCCNC2)c2nc(cn12)-c1ccc2ccccc2c1