Reaction Details
TargetP2Y purinoceptor 1
LigandBDBM50433798
Substrate/Competitorn/a
Meas. Tech.ChEMBL_958358 (CHEMBL2382617)
Ki 7.0±n/a nM
Citation Wang, TCQiao, JXClark, CGJua, JPrice, LAWu, QChang, MZheng, JHuang, CSEverlof, GSchumacher, WAWong, PCSeiffert, DAStewart, ABBostwick, JSCrain, EJWatson, CARehfuss, RWexler, RRLam, PY Discovery of diarylurea P2Y(1) antagonists with improved aqueous solubility. Bioorg Med Chem Lett23:3239-43 (2013) 
 
P2Y purinoceptor 1
Name:P2Y purinoceptor 1
Type:Enzyme
Mol. Mass.:42090.25
Organism:Homo sapiens (Human)
Description:P47900
Residue:373
BDBM50433798
NameBDBM50433798
Synonyms:CHEMBL2381894
TypeSmall organic molecule
Emp. Form.C33H37N5O2
Mol. Mass.535.6792
SMILESCC(C)(C)c1ccccc1Oc1ncccc1NC(=O)Nc1ccc(cc1)N1CCN(Cc2ccccc2)CC1