Reaction Details
TargetP2Y purinoceptor 1
LigandBDBM50433802
Substrate/Competitorn/a
Meas. Tech.ChEMBL_958358 (CHEMBL2382617)
Ki 1396±n/a nM
Citation Wang, TCQiao, JXClark, CGJua, JPrice, LAWu, QChang, MZheng, JHuang, CSEverlof, GSchumacher, WAWong, PCSeiffert, DAStewart, ABBostwick, JSCrain, EJWatson, CARehfuss, RWexler, RRLam, PY Discovery of diarylurea P2Y(1) antagonists with improved aqueous solubility. Bioorg Med Chem Lett23:3239-43 (2013) 
 
P2Y purinoceptor 1
Name:P2Y purinoceptor 1
Type:Enzyme
Mol. Mass.:42090.25
Organism:Homo sapiens (Human)
Description:P47900
Residue:373
BDBM50433802
NameBDBM50433802
Synonyms:CHEMBL2381890
TypeSmall organic molecule
Emp. Form.C30H36N4O2
Mol. Mass.484.6324
SMILESCC(C)(C)c1ccccc1Oc1ncccc1NC(=O)Nc1ccc(cc1)C1(CN2CCCC2)CC1