Reaction Details
TargetMatrix metalloproteinase-14
LigandBDBM50433866
Substrate/Competitorn/a
Meas. Tech.ChEMBL_959632 (CHEMBL2382702)
Ki 21±n/a nM
Citation Jin, YRoycik, MDBosco, DBCao, QConstantino, MHSchwartz, MASang, QX Matrix metalloproteinase inhibitors based on the 3-mercaptopyrrolidine core. J Med Chem56:4357-73 (2013) 
 
Matrix metalloproteinase-14
Name:Matrix metalloproteinase-14
Type:Protein
Mol. Mass.:65900.19
Organism:Homo sapiens (Human)
Description:P50281
Residue:582
BDBM50433866
NameBDBM50433866
Synonyms:CHEMBL2380314
TypeSmall organic molecule
Emp. Form.C27H26N4O6S2
Mol. Mass.566.649
SMILESS[C@H]1CN(C[C@@H]1NS(=O)(=O)c1ccc(Oc2ccccc2)cc1)C(=O)NCCN1C(=O)c2ccccc2C1=O