Reaction Details
TargetMatrix metalloproteinase-14
LigandBDBM50433868
Substrate/Competitorn/a
Meas. Tech.ChEMBL_959632 (CHEMBL2382702)
Ki 11±n/a nM
Citation Jin, YRoycik, MDBosco, DBCao, QConstantino, MHSchwartz, MASang, QX Matrix metalloproteinase inhibitors based on the 3-mercaptopyrrolidine core. J Med Chem56:4357-73 (2013) 
 
Matrix metalloproteinase-14
Name:Matrix metalloproteinase-14
Type:Protein
Mol. Mass.:65900.19
Organism:Homo sapiens (Human)
Description:P50281
Residue:582
BDBM50433868
NameBDBM50433868
Synonyms:CHEMBL2380400
TypeSmall organic molecule
Emp. Form.C17H19N3O4S2
Mol. Mass.393.48
SMILESNC(=O)N1C[C@H](S)[C@H](C1)NS(=O)(=O)c1ccc(Oc2ccccc2)cc1