Reaction Details
TargetMatrilysin
LigandBDBM50433868
Substrate/Competitorn/a
Meas. Tech.ChEMBL_959635 (CHEMBL2382705)
Ki>25000±n/a nM
Citation Jin, YRoycik, MDBosco, DBCao, QConstantino, MHSchwartz, MASang, QX Matrix metalloproteinase inhibitors based on the 3-mercaptopyrrolidine core. J Med Chem56:4357-73 (2013) 
 
Matrilysin
Name:Matrilysin
Type:Enzyme
Mol. Mass.:29681.54
Organism:Homo sapiens (Human)
Description:P09237
Residue:267
BDBM50433868
NameBDBM50433868
Synonyms:CHEMBL2380400
TypeSmall organic molecule
Emp. Form.C17H19N3O4S2
Mol. Mass.393.48
SMILESNC(=O)N1C[C@H](S)[C@H](C1)NS(=O)(=O)c1ccc(Oc2ccccc2)cc1