Reaction Details
TargetMatrilysin
LigandBDBM50433876
Substrate/Competitorn/a
Meas. Tech.ChEMBL_959635 (CHEMBL2382705)
Ki>200000±n/a nM
Citation Jin, YRoycik, MDBosco, DBCao, QConstantino, MHSchwartz, MASang, QX Matrix metalloproteinase inhibitors based on the 3-mercaptopyrrolidine core. J Med Chem56:4357-73 (2013) 
 
Matrilysin
Name:Matrilysin
Type:Enzyme
Mol. Mass.:29681.54
Organism:Homo sapiens (Human)
Description:P09237
Residue:267
BDBM50433876
NameBDBM50433876
Synonyms:CHEMBL2380391
TypeSmall organic molecule
Emp. Form.C17H19NO3S2
Mol. Mass.349.468
SMILESS[C@H]1CCC[C@H]1NS(=O)(=O)c1ccc(Oc2ccccc2)cc1