Reaction Details
TargetMatrilysin
LigandBDBM50433878
Substrate/Competitorn/a
Meas. Tech.ChEMBL_959635 (CHEMBL2382705)
Ki 12±n/a nM
Citation Jin, YRoycik, MDBosco, DBCao, QConstantino, MHSchwartz, MASang, QX Matrix metalloproteinase inhibitors based on the 3-mercaptopyrrolidine core. J Med Chem56:4357-73 (2013) 
 
Matrilysin
Name:Matrilysin
Type:Enzyme
Mol. Mass.:29681.54
Organism:Homo sapiens (Human)
Description:P09237
Residue:267
BDBM50433878
NameBDBM50433878
Synonyms:CHEMBL2380389
TypeSmall organic molecule
Emp. Form.C32H40N4O5S2
Mol. Mass.624.814
SMILESCNC(=O)[C@H](Cc1ccccc1)NC(=O)[C@@H](CC(C)C)S[C@H]1CN(C[C@H]1S)C(=O)CCCN1C(=O)c2ccccc2C1=O