Reaction Details
TargetProstate-specific antigen
LigandBDBM50434146
Substrate/Competitorn/a
Meas. Tech.ChEMBL_959198 (CHEMBL2383481)
Ki 73±n/a nM
Citation Kostova, MBRosen, DMChen, YMease, RCDenmeade, SR Structural optimization, biological evaluation, and application of peptidomimetic prostate specific antigen inhibitors. J Med Chem56:4224-35 (2013) 
 
Prostate-specific antigen
Name:Prostate-specific antigen
Type:PROTEIN
Mol. Mass.:28747.53
Organism:Homo sapiens (Human)
Description:ChEMBL_959198
Residue:261
BDBM50434146
NameBDBM50434146
Synonyms:CHEMBL2381670
TypeSmall organic molecule
Emp. Form.C43H69BBrN7O9
Mol. Mass.918.764
SMILESCCCC[C@H](NC(=O)[C@H](CCC(N)=O)NC(=O)[C@H](CO)NC(=O)[C@H](Cc1ccccc1)NC(=O)CCCCCN)C(=O)N[C@H](CCCBr)B1O[C@@H]2C[C@H]3C[C@H](C3(C)C)[C@]2(C)O1