Reaction Details
TargetSialidase-4
LigandBDBM50331680
Substrate/Competitorn/a
Meas. Tech.ChEMBL_960637 (CHEMBL2390090)
IC50 2100±n/a nM
Citation Albohy, AZhang, YSmutova, VPshezhetsky, AVCairo, CW Identification of Selective Nanomolar Inhibitors of the Human Neuraminidase, NEU4. ACS Med Chem Lett4:532-7 (2013) 
 
Sialidase-4
Name:Sialidase-4
Type:PROTEIN
Mol. Mass.:51579.82
Organism:Homo sapiens (Human)
Description:ChEMBL_960637
Residue:484
BDBM50331680
NameBDBM50331680
Synonyms:(2R,3R,4S)-3-acetamido-2-((1R,2R)-1,2-dihydroxy-3-(4-(3-hydroxypropyl)-1H-1,2,3-triazol-1-yl)propyl)-4-hydroxy-3,4-dihydro-2H-pyran-6-carboxylate | CHEMBL1289755
TypeSmall organic molecule
Emp. Form.C16H24N4O8
Mol. Mass.400.3838
SMILESCC(=O)N[C@@H]1[C@@H](O)C=C(O[C@H]1[C@H](O)[C@H](O)Cn1cc(CCCO)nn1)C(O)=O