Reaction Details
TargetSialidase-1
LigandBDBM50331679
Substrate/Competitorn/a
Meas. Tech.ChEMBL_960639 (CHEMBL2390092)
IC50>1000000±n/a nM
Citation Albohy, AZhang, YSmutova, VPshezhetsky, AVCairo, CW Identification of Selective Nanomolar Inhibitors of the Human Neuraminidase, NEU4. ACS Med Chem Lett4:532-7 (2013) 
 
Sialidase-1
Name:Sialidase-1
Type:PROTEIN
Mol. Mass.:45463.28
Organism:Homo sapiens (Human)
Description:ChEMBL_960639
Residue:415
BDBM50331679
NameBDBM50331679
Synonyms:(2R,3R,4S)-3-acetamido-2-((1R,2R)-1,2-dihydroxy-3-(4-(2-hydroxyethyl)-1H-1,2,3-triazol-1-yl)propyl)-4-hydroxy-3,4-dihydro-2H-pyran-6-carboxylate | CHEMBL1289754
TypeSmall organic molecule
Emp. Form.C15H22N4O8
Mol. Mass.386.3572
SMILESCC(=O)N[C@@H]1[C@@H](O)C=C(O[C@H]1[C@H](O)[C@H](O)Cn1cc(CCO)nn1)C(O)=O