Reaction Details
TargetSerine/threonine-protein kinase PAK 2
LigandBDBM50434333
Substrate/Competitorn/a
Meas. Tech.ChEMBL_960988 (CHEMBL2388904)
IC50 244±n/a nM
Citation Abdel-Magid, AF PAK1: A Therapeutic Target for Cancer Treatment. ACS Med Chem Lett4:431-2 (2013) 
 
Serine/threonine-protein kinase PAK 2
Name:Serine/threonine-protein kinase PAK 2
Type:Enzyme
Mol. Mass.:58037.40
Organism:Homo sapiens (Human)
Description:Q13177
Residue:524
BDBM50434333
NameBDBM50434333
Synonyms:CHEMBL2386718
TypeSmall organic molecule
Emp. Form.C19H18F2N8
Mol. Mass.396.3966
SMILESC[C@H](Nc1nccc(Nc2cc(n[nH]2)C2CC2(F)F)n1)c1ccc2nc[nH]c2c1