Reaction Details
TargetSerine/threonine-protein kinase PAK 1
LigandBDBM50434332
Substrate/Competitorn/a
Meas. Tech.ChEMBL_960990 (CHEMBL2388906)
Ki 6.8±n/a nM
Citation Abdel-Magid, AF PAK1: A Therapeutic Target for Cancer Treatment. ACS Med Chem Lett4:431-2 (2013) 
 
Serine/threonine-protein kinase PAK 1
Name:Serine/threonine-protein kinase PAK 1
Type:n/a
Mol. Mass.:60640.15
Organism:Homo sapiens (Human)
Description:Q13153
Residue:545
BDBM50434332
NameBDBM50434332
Synonyms:CHEMBL2386716
TypeSmall organic molecule
Emp. Form.C21H23N7
Mol. Mass.373.4542
SMILESC[C@H](Nc1nccc(Nc2cc(n[nH]2)C2CCC2)n1)c1ccc2[nH]ccc2c1