Reaction Details
TargetHistamine H3 receptor
LigandBDBM50434335
Substrate/Competitorn/a
Meas. Tech.ChEMBL_961000 (CHEMBL2388916)
Ki 0.02±n/a nM
Citation Rosse, G Novel thiazolobenzodiazepines as inhibitors of histamine h3 receptor. ACS Med Chem Lett4:435-435 (2013) 
 
Histamine H3 receptor
Name:Histamine H3 receptor
Type:G Protein-Coupled Receptor (GPCR)
Mol. Mass.:48607.98
Organism:Rattus norvegicus (rat)
Description:n/a
Residue:445
BDBM50434335
NameBDBM50434335
Synonyms:CHEMBL2386729 | US9181275, 3
TypeSmall organic molecule
Emp. Form.C26H31N3OS
Mol. Mass.433.609
SMILESC[C@@H]1CCCN1CCCOc1ccc(cc1)C1=C(C)N2Cc3ccccc3CN=C2S1