Reaction Details
TargetDual specificity tyrosine-phosphorylation-regulated kinase 1A
LigandBDBM50434360
Substrate/Competitorn/a
Meas. Tech.ChEMBL_961005 (CHEMBL2388921)
IC50 36±n/a nM
Citation Rosse, G Tricyclic Pyrimidines As Inhibitors of DYRK1A/DYRK1B As Potential Treatment for Down's Syndrome or Alzheimer's Disease. ACS Med Chem Lett4:502-3 (2013) 
 
Dual specificity tyrosine-phosphorylation-regulated kinase 1A
Name:Dual specificity tyrosine-phosphorylation-regulated kinase 1A
Type:Enzyme
Mol. Mass.:85616.61
Organism:Homo sapiens (Human)
Description:Q13627
Residue:763
BDBM50434360
NameBDBM50434360
Synonyms:CHEMBL2386768 | US9446044, 76
TypeSmall organic molecule
Emp. Form.C19H18N6OS
Mol. Mass.378.451
SMILESCOC(=N)c1nc2ccc3ncnc(Nc4ccc(cc4)N(C)C)c3c2s1