Reaction Details
TargetDual specificity tyrosine-phosphorylation-regulated kinase 1A
LigandBDBM50434365
Substrate/Competitorn/a
Meas. Tech.ChEMBL_961005 (CHEMBL2388921)
IC50 1.8±n/a nM
Citation Rosse, G Tricyclic Pyrimidines As Inhibitors of DYRK1A/DYRK1B As Potential Treatment for Down's Syndrome or Alzheimer's Disease. ACS Med Chem Lett4:502-3 (2013) 
 
Dual specificity tyrosine-phosphorylation-regulated kinase 1A
Name:Dual specificity tyrosine-phosphorylation-regulated kinase 1A
Type:Enzyme
Mol. Mass.:85616.61
Organism:Homo sapiens (Human)
Description:Q13627
Residue:763
BDBM50434365
NameBDBM50434365
Synonyms:CHEMBL2386763 | US9446044, 64
TypeSmall organic molecule
Emp. Form.C17H13N5OS
Mol. Mass.335.383
SMILESCOC(=N)c1nc2ccc3ncnc(Nc4ccccc4)c3c2s1