Reaction Details
TargetDual specificity tyrosine-phosphorylation-regulated kinase 1B
LigandBDBM50434341
Substrate/Competitorn/a
Meas. Tech.ChEMBL_961004 (CHEMBL2388920)
IC50 32±n/a nM
Citation Rosse, G Tricyclic Pyrimidines As Inhibitors of DYRK1A/DYRK1B As Potential Treatment for Down's Syndrome or Alzheimer's Disease. ACS Med Chem Lett4:502-3 (2013) 
 
Dual specificity tyrosine-phosphorylation-regulated kinase 1B
Name:Dual specificity tyrosine-phosphorylation-regulated kinase 1B
Type:Enzyme
Mol. Mass.:69222.24
Organism:Homo sapiens (Human)
Description:Q9Y463
Residue:629
BDBM50434341
NameBDBM50434341
Synonyms:CHEMBL2386759 | US9446044, 86
TypeSmall organic molecule
Emp. Form.C16H9BrFN5OS
Mol. Mass.418.243
SMILESNC(=O)c1nc2ccc3ncnc(Nc4ccc(F)cc4Br)c3c2s1