Reaction Details
TargetDual specificity tyrosine-phosphorylation-regulated kinase 1B
LigandBDBM50434342
Substrate/Competitorn/a
Meas. Tech.ChEMBL_961004 (CHEMBL2388920)
IC50 486±n/a nM
Citation Rosse, G Tricyclic Pyrimidines As Inhibitors of DYRK1A/DYRK1B As Potential Treatment for Down's Syndrome or Alzheimer's Disease. ACS Med Chem Lett4:502-3 (2013) 
 
Dual specificity tyrosine-phosphorylation-regulated kinase 1B
Name:Dual specificity tyrosine-phosphorylation-regulated kinase 1B
Type:Enzyme
Mol. Mass.:69222.24
Organism:Homo sapiens (Human)
Description:Q9Y463
Residue:629
BDBM50434342
NameBDBM50434342
Synonyms:CHEMBL2386758 | US9446044, 61
TypeSmall organic molecule
Emp. Form.C20H19N5O4S
Mol. Mass.425.461
SMILESCOC(=N)c1nc2ccc3ncnc(Nc4cc(OC)c(OC)c(OC)c4)c3c2s1