Reaction Details
TargetMicrotubule-associated protein tau
LigandBDBM15236
Substrate/Competitorn/a
Meas. Tech.ChEMBL_961356 (CHEMBL2390683)
IC50 1200±n/a nM
Citation Bulic, BPickhardt, MMandelkow, E Progress and developments in tau aggregation inhibitors for Alzheimer disease. J Med Chem56:4135-55 (2013) 
 
Microtubule-associated protein tau
Name:Microtubule-associated protein tau
Type:Protein
Mol. Mass.:78928.63
Organism:Homo sapiens (Human)
Description:P10636
Residue:758
BDBM15236
NameBDBM15236
Synonyms:3,5,7-trihydroxy-2-(3,4,5-trihydroxyphenyl)-4H-chromen-4-one CHEMBL164 Myricetin Myricetin (Myr) | cid_5281672
TypeSmall organic molecule
Emp. Form.C15H10O8
Mol. Mass.318.2351
SMILESOc1cc(O)c2c(c1)oc(-c1cc(O)c(O)c(O)c1)c(O)c2=O