Reaction Details
TargetNociceptin receptor
LigandBDBM50147740
Substrate/Competitorn/a
Meas. Tech.ChEMBL_960443 (CHEMBL2389094)
Ki 1.4±n/a nM
Citation Zaveri, NTJiang, FOlsen, CPolgar, WEToll, L Designing bifunctional NOP receptor-mu opioid receptor ligands from NOP receptor-selective scaffolds. Part I. Bioorg Med Chem Lett23:3308-13 (2013) 
 
Nociceptin receptor
Name:Nociceptin receptor
Type:G Protein-Coupled Receptor (GPCR)
Mol. Mass.:40702.87
Organism:Homo sapiens (Human)
Description:P41146
Residue:370
BDBM50147740
NameBDBM50147740
Synonyms:1-(1-Cyclooctyl-piperidin-4-yl)-1,3-dihydro-indol-2-one | CHEMBL101454
TypeSmall organic molecule
Emp. Form.C21H30N2O
Mol. Mass.326.4757
SMILESO=C1Cc2ccccc2N1C1CCN(CC1)C1CCCCCCC1