Reaction Details
TargetSerine/threonine-protein kinase pim-1
LigandBDBM50434652
Substrate/Competitorn/a
Meas. Tech.ChEMBL_960801 (CHEMBL2388109)
Ki 1.1±n/a nM
Citation Wang, XMagnuson, SPastor, RFan, EHu, HTsui, VDeng, WMurray, JSteffek, MWallweber, HMoffat, JDrummond, JChan, GHarstad, EEbens, AJ Discovery of novel pyrazolo[1,5-a]pyrimidines as potent pan-Pim inhibitors by structure- and property-based drug design. Bioorg Med Chem Lett23:3149-53 (2013) 
 
Serine/threonine-protein kinase pim-1
Name:Serine/threonine-protein kinase pim-1
Type:Protein
Mol. Mass.:35681.82
Organism:Homo sapiens (Human)
Description:P11309
Residue:313
BDBM50434652
NameBDBM50434652
Synonyms:CHEMBL2387467
TypeSmall organic molecule
Emp. Form.C21H14FN5O2
Mol. Mass.387.3666
SMILESFc1ccc(NC(=O)c2c[nH]n3c2nc(Cc2ccc(cc2)C#N)cc3=O)cc1