Reaction Details
TargetSerine/threonine-protein kinase pim-3
LigandBDBM50434657
Substrate/Competitorn/a
Meas. Tech.ChEMBL_960798 (CHEMBL2387967)
Ki 0.036000±n/a nM
Citation Wang, XMagnuson, SPastor, RFan, EHu, HTsui, VDeng, WMurray, JSteffek, MWallweber, HMoffat, JDrummond, JChan, GHarstad, EEbens, AJ Discovery of novel pyrazolo[1,5-a]pyrimidines as potent pan-Pim inhibitors by structure- and property-based drug design. Bioorg Med Chem Lett23:3149-53 (2013) 
 
Serine/threonine-protein kinase pim-3
Name:Serine/threonine-protein kinase pim-3
Type:Protein
Mol. Mass.:35888.19
Organism:Homo sapiens (Human)
Description:Q86V86
Residue:326
BDBM50434657
NameBDBM50434657
Synonyms:CHEMBL2387462
TypeSmall organic molecule
Emp. Form.C20H21FN8O
Mol. Mass.408.4321
SMILESFC1(CNc2ccn3ncc(C(=O)Nc4c[nH]c5ncccc45)c3n2)CCNCC1