Reaction Details
TargetSerine/threonine-protein kinase pim-1
LigandBDBM50434658
Substrate/Competitorn/a
Meas. Tech.ChEMBL_960801 (CHEMBL2388109)
Ki 0.011000±n/a nM
Citation Wang, XMagnuson, SPastor, RFan, EHu, HTsui, VDeng, WMurray, JSteffek, MWallweber, HMoffat, JDrummond, JChan, GHarstad, EEbens, AJ Discovery of novel pyrazolo[1,5-a]pyrimidines as potent pan-Pim inhibitors by structure- and property-based drug design. Bioorg Med Chem Lett23:3149-53 (2013) 
 
Serine/threonine-protein kinase pim-1
Name:Serine/threonine-protein kinase pim-1
Type:Protein
Mol. Mass.:35681.82
Organism:Homo sapiens (Human)
Description:P11309
Residue:313
BDBM50434658
NameBDBM50434658
Synonyms:CHEMBL2387479
TypeSmall organic molecule
Emp. Form.C20H21FN8O
Mol. Mass.408.4321
SMILESF[C@@H]1CNCC[C@H]1CNc1ccn2ncc(C(=O)Nc3c[nH]c4ncccc34)c2n1