Reaction Details
TargetBone morphogenetic protein receptor type-1A
LigandBDBM102618
Substrate/Competitorn/a
Meas. Tech.ChEMBL_961934 (CHEMBL2390525)
IC50 539±n/a nM
Citation Engers, DWFrist, AYLindsley, CWHong, CCHopkins, CR Synthesis and structure-activity relationships of a novel and selective bone morphogenetic protein receptor (BMP) inhibitor derived from the pyrazolo[1.5-a]pyrimidine scaffold of dorsomorphin: the discovery of ML347 as an ALK2 versus ALK3 selective MLPCN probe. Bioorg Med Chem Lett23:3248-52 (2013) 
 
Bone morphogenetic protein receptor type-1A
Name:Bone morphogenetic protein receptor type-1A
Type:Enzyme
Mol. Mass.:60204.46
Organism:Homo sapiens (Human)
Description:P36894
Residue:532
BDBM102618
NameBDBM102618
Synonyms:LDN-212854
TypeSmall organic molecule
Emp. Form.C25H22N6
Mol. Mass.406.4824
SMILESC1CN(CCN1)c1ccc(cc1)-c1cnc2c(cnn2c1)-c1cccc2ncccc12