Reaction Details
TargetBone morphogenetic protein 4
LigandBDBM50434751
Substrate/Competitorn/a
Meas. Tech.ChEMBL_961936 (CHEMBL2390527)
IC50 141±n/a nM
Citation Engers, DWFrist, AYLindsley, CWHong, CCHopkins, CR Synthesis and structure-activity relationships of a novel and selective bone morphogenetic protein receptor (BMP) inhibitor derived from the pyrazolo[1.5-a]pyrimidine scaffold of dorsomorphin: the discovery of ML347 as an ALK2 versus ALK3 selective MLPCN probe. Bioorg Med Chem Lett23:3248-52 (2013) 
 
Bone morphogenetic protein 4
Name:Bone morphogenetic protein 4
Type:PROTEIN
Mol. Mass.:46510.27
Organism:Mus musculus
Description:ChEMBL_107597
Residue:408
BDBM50434751
NameBDBM50434751
Synonyms:CHEMBL2385579
TypeSmall organic molecule
Emp. Form.C19H18N6O
Mol. Mass.346.3858
SMILESC1CN(CCO1)c1ccc(cc1)-c1cnc2c(cnn2c1)-c1cn[nH]c1