Reaction Details
TargetTyrosine-protein kinase JAK1
LigandBDBM50434782
Substrate/Competitorn/a
Meas. Tech.ChEMBL_962508 (CHEMBL2390550)
Ki 0.800000±n/a nM
Citation Zak, MHurley, CAWard, SIBergeron, PBarrett, KBalazs, MBlair, WSBull, RChakravarty, PChang, CCrackett, PDeshmukh, GDeVoss, JDragovich, PSEigenbrot, CEllwood, CGaines, SGhilardi, NGibbons, PGradl, SGribling, PHamman, CHarstad, EHewitt, PJohnson, AJohnson, TKenny, JRKoehler, MFBir Kohli, PLabadie, SLee, WPLiao, JLiimatta, MMendonca, RNarukulla, RPulk, RReeve, ASavage, SShia, SSteffek, MUbhayakar, Svan Abbema, AAliagas, IAvitabile-Woo, BXiao, YYang, JKulagowski, JJ Identification of C-2 hydroxyethyl imidazopyrrolopyridines as potent JAK1 inhibitors with favorable physicochemical properties and high selectivity over JAK2. J Med Chem56:4764-85 (2013) 
 
Tyrosine-protein kinase JAK1
Name:Tyrosine-protein kinase JAK1
Type:Protein
Mol. Mass.:133293.73
Organism:Homo sapiens (Human)
Description:P23458
Residue:1154
BDBM50434782
NameBDBM50434782
Synonyms:CHEMBL2386640
TypeSmall organic molecule
Emp. Form.C16H20N4O
Mol. Mass.284.3562
SMILESC[C@@H](O)c1nc2cnc3[nH]ccc3c2n1C1CCCCC1