Reaction Details
TargetG-protein coupled receptor 55
LigandBDBM50398222
Substrate/Competitorn/a
Meas. Tech.ChEMBL_963381 (CHEMBL2388878)
IC50 358±n/a nM
Citation Rempel, VVolz, NGläser, FNieger, MBräse, SMüller, CE Antagonists for the orphan G-protein-coupled receptor GPR55 based on a coumarin scaffold. J Med Chem56:4798-810 (2013) 
 
G-protein coupled receptor 55
Name:G-protein coupled receptor 55
Type:PROTEIN
Mol. Mass.:36649.72
Organism:Homo sapiens (Human)
Description:ChEMBL_1292265
Residue:319
BDBM50398222
NameBDBM50398222
Synonyms:CHEMBL2177264
TypeSmall organic molecule
Emp. Form.C25H30O3
Mol. Mass.378.5039
SMILESCCCCCCC(C)(C)c1cc(O)c2cc(Cc3ccccc3)c(=O)oc2c1