Reaction Details
TargetG-protein coupled receptor 55
LigandBDBM50398233
Substrate/Competitorn/a
Meas. Tech.ChEMBL_963381 (CHEMBL2388878)
IC50 5080±n/a nM
Citation Rempel, VVolz, NGläser, FNieger, MBräse, SMüller, CE Antagonists for the orphan G-protein-coupled receptor GPR55 based on a coumarin scaffold. J Med Chem56:4798-810 (2013) 
 
G-protein coupled receptor 55
Name:G-protein coupled receptor 55
Type:PROTEIN
Mol. Mass.:36649.72
Organism:Homo sapiens (Human)
Description:ChEMBL_1292265
Residue:319
BDBM50398233
NameBDBM50398233
Synonyms:CHEMBL2177253
TypeSmall organic molecule
Emp. Form.C23H26O3
Mol. Mass.350.4507
SMILESCCCCCc1cc(OC)c2cc(Cc3ccccc3C)c(=O)oc2c1