Reaction Details
TargetCasein kinase I isoform epsilon
LigandBDBM50435027
Substrate/Competitorn/a
Meas. Tech.ChEMBL_964507 (CHEMBL2393652)
IC50>100000±n/a nM
Citation Lo Monte, FKramer, TGu, JBrodrecht, MPilakowski, JFuertes, ADominguez, JMPlotkin, BEldar-Finkelman, HSchmidt, B Structure-based optimization of oxadiazole-based GSK-3 inhibitors. Eur J Med Chem61:26-40 (2013) 
 
Casein kinase I isoform epsilon
Name:Casein kinase I isoform epsilon
Type:Protein
Mol. Mass.:47340.25
Organism:Homo sapiens (Human)
Description:P49674
Residue:416
BDBM50435027
NameBDBM50435027
Synonyms:CHEMBL2391099
TypeSmall organic molecule
Emp. Form.C20H15N3OS
Mol. Mass.345.418
SMILESC(Sc1nnc(o1)-c1ccncc1)c1ccc(cc1)-c1ccccc1