Reaction Details
TargetAurora kinase A
LigandBDBM50435039
Substrate/Competitorn/a
Meas. Tech.ChEMBL_964506 (CHEMBL2393651)
IC50 45000±n/a nM
Citation Lo Monte, FKramer, TGu, JBrodrecht, MPilakowski, JFuertes, ADominguez, JMPlotkin, BEldar-Finkelman, HSchmidt, B Structure-based optimization of oxadiazole-based GSK-3 inhibitors. Eur J Med Chem61:26-40 (2013) 
 
Aurora kinase A
Name:Aurora kinase A
Type:Serine/threonine-protein kinase
Mol. Mass.:45830.98
Organism:Homo sapiens (Human)
Description:O14965
Residue:403
BDBM50435039
NameBDBM50435039
Synonyms:CHEMBL2391118
TypeSmall organic molecule
Emp. Form.C24H17N3O4S
Mol. Mass.443.474
SMILESCOc1ccc(-c2ccc(CSc3nnc(o3)-c3ccc4OCOc4c3)cc2)c(c1)C#N