Reaction Details
TargetAurora kinase A
LigandBDBM50435030
Substrate/Competitorn/a
Meas. Tech.ChEMBL_964506 (CHEMBL2393651)
IC50>100000±n/a nM
Citation Lo Monte, FKramer, TGu, JBrodrecht, MPilakowski, JFuertes, ADominguez, JMPlotkin, BEldar-Finkelman, HSchmidt, B Structure-based optimization of oxadiazole-based GSK-3 inhibitors. Eur J Med Chem61:26-40 (2013) 
 
Aurora kinase A
Name:Aurora kinase A
Type:Serine/threonine-protein kinase
Mol. Mass.:45830.98
Organism:Homo sapiens (Human)
Description:O14965
Residue:403
BDBM50435030
NameBDBM50435030
Synonyms:CHEMBL2390958
TypeSmall organic molecule
Emp. Form.C21H14N4OS
Mol. Mass.370.427
SMILESN#Cc1ccc(cc1)-c1ccc(CSc2nnc(o2)-c2ccncc2)cc1