Reaction Details
TargetOxytocin receptor
LigandBDBM50435057
Substrate/Competitorn/a
Meas. Tech.ChEMBL_964687 (CHEMBL2394479)
Ki 5.2±n/a nM
Citation Smith, ALFreeman, SMVoll, RJYoung, LJGoodman, MM Carbon-11 N-methyl alkylation of L-368,899 and in vivo PET imaging investigations for neural oxytocin receptors. Bioorg Med Chem Lett23:902-6 (2013) 
 
Oxytocin receptor
Name:Oxytocin receptor
Type:Enzyme Catalytic Domain
Mol. Mass.:42793.26
Organism:Homo sapiens (Human)
Description:Oxytocin OXTR HEK293::B2R9L7
Residue:389
BDBM50435057
NameBDBM50435057
Synonyms:CHEMBL2391300
TypeSmall organic molecule
Emp. Form.C27H44N4O5S2
Mol. Mass.568.792
SMILESCN[C@@H](CCS(C)(=O)=O)C(=O)N[C@H]1C[C@H]2CC[C@]1(CS(=O)(=O)N1CCN(CC1)c1ccccc1C)C2(C)C