Reaction Details
TargetAcetylcholinesterase
LigandBDBM50435267
Substrate/Competitorn/a
Meas. Tech.ChEMBL_963635 (CHEMBL2395154)
IC50 16±n/a nM
Citation Eckroat, TJGreen, KDReed, RABornstein, JJGarneau-Tsodikova, S Investigation of the role of linker moieties in bifunctional tacrine hybrids. Bioorg Med Chem21:3614-23 (2013) 
 
Acetylcholinesterase
Name:Acetylcholinesterase
Type:Enzyme
Mol. Mass.:71812.79
Organism:Electrophorus electricus (Electric eel)
Description:n/a
Residue:633
BDBM50435267
NameBDBM50435267
Synonyms:CHEMBL2393089
TypeSmall organic molecule
Emp. Form.C40H51ClN4O
Mol. Mass.639.312
SMILESCc1cccc(Nc2ccccc2C(=O)NCCCCCCCCCCCCNc2c3CCCCc3nc3cc(Cl)ccc23)c1C