Reaction Details
TargetAcetylcholinesterase
LigandBDBM50435285
Substrate/Competitorn/a
Meas. Tech.ChEMBL_963635 (CHEMBL2395154)
IC50 17±n/a nM
Citation Eckroat, TJGreen, KDReed, RABornstein, JJGarneau-Tsodikova, S Investigation of the role of linker moieties in bifunctional tacrine hybrids. Bioorg Med Chem21:3614-23 (2013) 
 
Acetylcholinesterase
Name:Acetylcholinesterase
Type:Enzyme
Mol. Mass.:71812.79
Organism:Electrophorus electricus (Electric eel)
Description:n/a
Residue:633
BDBM50435285
NameBDBM50435285
Synonyms:CHEMBL2393101
TypeSmall organic molecule
Emp. Form.C22H31ClN2
Mol. Mass.358.948
SMILESCCCCCCCCCNc1c2CCCCc2nc2cc(Cl)ccc12