Reaction Details
TargetAcetylcholinesterase
LigandBDBM50435271
Substrate/Competitorn/a
Meas. Tech.ChEMBL_963636 (CHEMBL2395155)
IC50 11±n/a nM
Citation Eckroat, TJGreen, KDReed, RABornstein, JJGarneau-Tsodikova, S Investigation of the role of linker moieties in bifunctional tacrine hybrids. Bioorg Med Chem21:3614-23 (2013) 
 
Acetylcholinesterase
Name:Acetylcholinesterase
Type:Enzyme
Mol. Mass.:71812.79
Organism:Electrophorus electricus (Electric eel)
Description:n/a
Residue:633
BDBM50435271
NameBDBM50435271
Synonyms:CHEMBL2393226
TypeSmall organic molecule
Emp. Form.C41H52ClN5O2
Mol. Mass.682.337
SMILESCc1cccc(Nc2ccccc2C(=O)NCCCCCC(=O)NCCCCCCCNc2c3CCCCc3nc3cc(Cl)ccc23)c1C