Reaction Details
TargetAcetylcholinesterase
LigandBDBM50435281
Substrate/Competitorn/a
Meas. Tech.ChEMBL_963636 (CHEMBL2395155)
IC50 2470±n/a nM
Citation Eckroat, TJGreen, KDReed, RABornstein, JJGarneau-Tsodikova, S Investigation of the role of linker moieties in bifunctional tacrine hybrids. Bioorg Med Chem21:3614-23 (2013) 
 
Acetylcholinesterase
Name:Acetylcholinesterase
Type:Enzyme
Mol. Mass.:71812.79
Organism:Electrophorus electricus (Electric eel)
Description:n/a
Residue:633
BDBM50435281
NameBDBM50435281
Synonyms:CHEMBL2393105
TypeSmall organic molecule
Emp. Form.C35H40ClN5O2
Mol. Mass.598.177
SMILESCc1cccc(Nc2ccccc2C(=O)NCCC(=O)NCCCCNc2c3CCCCc3nc3cc(Cl)ccc23)c1C